Last Comment Bug 767034 - xpcom/glue/arm.cpp:165: error: expected declaration before '}' token
: xpcom/glue/arm.cpp:165: error: expected declaration before '}' token
Status: RESOLVED FIXED
:
Product: Core
Classification: Components
Component: XPCOM (show other bugs)
: Trunk
: ARM Linux
: -- normal (vote)
: mozilla16
Assigned To: Nobody; OK to take it and work on it
:
:
Mentors:
Depends on:
Blocks: 650162
  Show dependency treegraph
 
Reported: 2012-06-21 10:17 PDT by Oleg Romashin (:romaxa)
Modified: 2012-06-22 03:45 PDT (History)
1 user (show)
See Also:
Crash Signature:
(edit)
QA Whiteboard:
Iteration: ---
Points: ---
Has Regression Range: ---
Has STR: ---


Attachments
Build fix (556 bytes, patch)
2012-06-21 10:19 PDT, Oleg Romashin (:romaxa)
tterribe: review+
Details | Diff | Splinter Review

Description Oleg Romashin (:romaxa) 2012-06-21 10:17:29 PDT
Attempt to build nightly on Harmattan sbox, failed with next message:
c++ -o arm.o -c  -fvisibility=hidden -DMOZ_GLUE_IN_PROGRAM -DTARGET_XPCOM_ABI=\"arm-eabi-gcc3\" -Ixpcom/glue/../build  -Ixpcom/glue -I. -I../../dist/include  -Iobj-build/dist/include/nspr -Iobj-build/dist/include/nss      -fPIC  -pedantic -Wall -Wpointer-arith -Woverloaded-virtual -Werror=return-type -Wtype-limits -Wempty-body -Wno-ctor-dtor-privacy -Wno-overlength-strings -Wno-invalid-offsetof -Wno-variadic-macros -Wno-long-long -fno-exceptions -fno-strict-aliasing -ffunction-sections -fdata-sections -fno-exceptions -std=gnu++0x -pthread -pipe  -DNDEBUG -DTRIMMED -gdwarf-2 -O3 -g -fomit-frame-pointer   -DMOZILLA_CLIENT -include ../../mozilla-config.h -MD -MF .deps/arm.pp xpcom/glue/arm.cpp
xpcom/glue/arm.cpp:165: error: expected declaration before '}' token
xpcom/glue/arm.cpp:141: warning: 'bool<unnamed>::check_edsp()' defined but not used
xpcom/glue/arm.cpp:149: warning: 'bool<unnamed>::check_armv6()' defined but not used
make[1]: *** [arm.o] Error 1
make[1]: Leaving directory `obj-build/xpcom/glue'
Comment 1 Oleg Romashin (:romaxa) 2012-06-21 10:19:28 PDT
Created attachment 635362 [details] [diff] [review]
Build fix
Comment 3 Ed Morley [:emorley] 2012-06-22 03:45:14 PDT
https://hg.mozilla.org/mozilla-central/rev/234979ecbf50

Note You need to log in before you can comment on or make changes to this bug.