Last Comment Bug 773706 - make install fails to build omni.ja in dist/firefox/webapprt: syntax error near unexpected token `)'
: make install fails to build omni.ja in dist/firefox/webapprt: syntax error ne...
Status: RESOLVED FIXED
[qa-]
:
Product: Firefox
Classification: Client Software
Component: Build Config (show other bugs)
: 15 Branch
: x86_64 Linux
: -- normal (vote)
: Firefox 15
Assigned To: Myk Melez [:myk] [@mykmelez]
:
Mentors:
Depends on:
Blocks:
  Show dependency treegraph
 
Reported: 2012-07-13 10:06 PDT by David A. Madore
Modified: 2012-07-15 09:27 PDT (History)
2 users (show)
See Also:
Crash Signature:
(edit)
QA Whiteboard:
Iteration: ---
Points: ---
Has Regression Range: ---
Has STR: ---


Attachments

Description David A. Madore 2012-07-13 10:06:34 PDT
Compilation of Firefox 15 Aurora compiles successfully, but make install fails, due to a stray closed parenthesis in the building of omni.ja in dist/firefox/webapprt; this is on an up-to-date Debian Testing (but with gcc-4.6), using the Firefox snapshot of <URL: http://hg.mozilla.org/releases/mozilla-aurora/file/156d908eccd4 >.

Last lines are:

cd ../../dist/firefox/webapprt && rm -f omni.ja; /usr/bin/zip -r9m omni.ja chrome chrome.manifest components/*.js components/*.xpt components/*.manifest modules res defaults greprefs.js jsloader jssubloader hyphenation update.locale  -x chrome/icons/\* defaults/preferences/channel-prefs.js defaults/pref/channel-prefs.js res/cursors/\* res/MainMenu.nib/\*  && /usr/src/local/mozilla/obj-x86_64-unknown-linux-gnu/_virtualenv/bin/python /usr/src/local/mozilla/config/optimizejars.py --optimize /usr/src/local/mozilla/obj-x86_64-unknown-linux-gnu/browser/installer/../../jarlog//en-US ./ ./)
/bin/sh: -c: line 0: syntax error near unexpected token `)'
/bin/sh: -c: line 0: `cd ../../dist/firefox/webapprt && rm -f omni.ja; /usr/bin/zip -r9m omni.ja chrome chrome.manifest components/*.js components/*.xpt components/*.manifest modules res defaults greprefs.js jsloader jssubloader hyphenation update.locale  -x chrome/icons/\* defaults/preferences/channel-prefs.js defaults/pref/channel-prefs.js res/cursors/\* res/MainMenu.nib/\*  && /usr/src/local/mozilla/obj-x86_64-unknown-linux-gnu/_virtualenv/bin/python /usr/src/local/mozilla/config/optimizejars.py --optimize /usr/src/local/mozilla/obj-x86_64-unknown-linux-gnu/browser/installer/../../jarlog//en-US ./ ./)'
make[2]: *** [install] Error 1
make[2]: Leaving directory `/usr/src/local/mozilla/obj-x86_64-unknown-linux-gnu/browser/installer'
make[1]: *** [install] Error 2
make[1]: Leaving directory `/usr/src/local/mozilla/obj-x86_64-unknown-linux-gnu'
make: *** [install] Error 2

The full install log is in <URL: http://www.madore.org/~david/.tmp/mozilla-20120713-install.log >.
Comment 1 Myk Melez [:myk] [@mykmelez] 2012-07-13 10:27:43 PDT
This sounds like bug 761975, which we should be able to uplift to aurora.
Comment 2 Myk Melez [:myk] [@mykmelez] 2012-07-13 14:21:36 PDT
Resolved by uplift of the fix for bug 761975 to Aurora:

https://hg.mozilla.org/releases/mozilla-aurora/rev/5a17af2f7a20

Note You need to log in before you can comment on or make changes to this bug.