comm-release releases are repackaging on Windows 64-bit machines

RESOLVED FIXED

Status

Release Engineering
General
RESOLVED FIXED
5 years ago
2 months ago

People

(Reporter: armenzg, Assigned: bhearsum)

Tracking

Firefox Tracking Flags

(Not tracked)

Details

Attachments

(2 attachments)

(Reporter)

Description

5 years ago
Created attachment 730856 [details]
log

bhearsum says that we need some overrides.

Full log attached.

checking for minimum required Python version >= 2.5... yes 
*** Fix above errors and then restart with               "make -f client.mk build"
make[1]: Leaving directory `/e/builds/moz2_slave/tb-rel-c-rel-w32_rpk_5/comm-esr17'
command: ERROR
Traceback (most recent call last):
  File "e:/builds/moz2_slave/tb-rel-c-rel-w32_rpk_5/scripts/scripts/l10n\../../lib/python\util\commands.py", line 40, in run_cmd
    return subprocess.check_call(cmd, **kwargs)
  File "c:\mozilla-build\python27\lib\subprocess.py", line 511, in check_call
    raise CalledProcessError(retcode, cmd)
CalledProcessError: Command '['make', '-f', 'client.mk', 'configure']' returned non-zero exit status 2
command: END (464.25s elapsed)

configure: error: You are targeting i386 but using the 64-bit compiler.
make[1]: *** [configure] Error 1
make: *** [configure] Error 2
Traceback (most recent call last):
  File "e:/builds/moz2_slave/tb-rel-c-rel-w32_rpk_5/scripts/scripts/l10n/create-release-repacks.py", line 259, in <module>
    partialUpdates=releaseConfig["partialUpdates"],
  File "e:/builds/moz2_slave/tb-rel-c-rel-w32_rpk_5/scripts/scripts/l10n/create-release-repacks.py", line 74, in createRepacks
    localeSrcDir, env)
  File "e:/builds/moz2_slave/tb-rel-c-rel-w32_rpk_5/scripts/scripts/l10n\../../lib/python\build\l10n.py", line 53, in l10nRepackPrep
    env=env)
  File "e:/builds/moz2_slave/tb-rel-c-rel-w32_rpk_5/scripts/scripts/l10n\../../lib/python\util\commands.py", line 40, in run_cmd
    return subprocess.check_call(cmd, **kwargs)
  File "c:\mozilla-build\python27\lib\subprocess.py", line 511, in check_call
    raise CalledProcessError(retcode, cmd)
subprocess.CalledProcessError: Command '['make', '-f', 'client.mk', 'configure']' returned non-zero exit status 2
(Assignee)

Updated

5 years ago
Summary: TB releases are repackaging on Windows 64-bit machines → comm-release releases are repackaging on Windows 64-bit machines
(Assignee)

Comment 1

5 years ago
Created attachment 730859 [details] [diff] [review]
fix win32 l10n slave override on comm-release

I screwed up the merge when I backed out bug 825630. This should fix us up.
Attachment #730859 - Flags: review?(armenzg)
(Reporter)

Comment 2

5 years ago
Comment on attachment 730859 [details] [diff] [review]
fix win32 l10n slave override on comm-release

MERGE DAY note?
Attachment #730859 - Flags: review?(armenzg) → review+
(Assignee)

Comment 3

5 years ago
Comment on attachment 730859 [details] [diff] [review]
fix win32 l10n slave override on comm-release

Committed to default + production, retagged. Reconfig in progress.
Attachment #730859 - Flags: checked-in+
(Assignee)

Updated

5 years ago
Status: NEW → RESOLVED
Last Resolved: 5 years ago
Resolution: --- → FIXED
Product: mozilla.org → Release Engineering
Component: General Automation → General
Product: Release Engineering → Release Engineering
You need to log in before you can comment on or make changes to this bug.