Last Comment Bug 663748 - (make check failures) Windows x86-64 failing a few random things in jit_test.py most builds
: (make check failures) Windows x86-64 failing a few random things in jit_test....
Status: RESOLVED FIXED
[js-triage-needed][inbound]
: intermittent-failure
Product: Core
Classification: Components
Component: JavaScript Engine (show other bugs)
: Trunk
: x86_64 Windows 7
: -- normal (vote)
: mozilla9
Assigned To: Makoto Kato [:m_kato]
:
Mentors:
: 670697 (view as bug list)
Depends on: 669564
Blocks: tracking_win64 support-win64 438871
  Show dependency treegraph
 
Reported: 2011-06-12 22:36 PDT by Phil Ringnalda (:philor)
Modified: 2012-11-25 19:31 PST (History)
4 users (show)
See Also:
Crash Signature:
(edit)
QA Whiteboard:
Iteration: ---
Points: ---
Has Regression Range: ---
Has STR: ---


Attachments
potential fix (1.03 KB, patch)
2011-08-31 05:22 PDT, Makoto Kato [:m_kato]
luke: review+
Details | Diff | Review

Description Phil Ringnalda (:philor) 2011-06-12 22:36:10 PDT
Tough to say exactly when it started, or whether it started from code-related reasons or not, since the builds are hidden so nobody ever looks at them, and there's only one build slave so it runs on random pushes when it gets around to it.

http://tinderbox.mozilla.org/showlog.cgi?log=Firefox/1307575035.1307588579.1656.gz
WINNT 6.1 x86-64 mozilla-central build on 2011/06/08 16:17:15
s: mw64-ix-slave01

TEST-UNEXPECTED-FAIL | jit_test.py -a -m -j -p    | e:\builds\moz2_slave\cen-w64\build\js\src\jit-test\tests\jaeger\bug577580.js
Comment 1 Phil Ringnalda (:philor) 2011-06-12 22:41:05 PDT
http://tinderbox.mozilla.org/showlog.cgi?log=Firefox/1307603173.1307615792.6604.gz
TEST-UNEXPECTED-FAIL | jit_test.py -a -m -j | e:\builds\moz2_slave\cen-w64\build\js\src\jit-test\tests\jaeger\bug554580-1.js
Comment 2 Treeherder Robot 2011-06-12 22:41:14 PDT
philor
http://tinderbox.mozilla.org/showlog.cgi?log=Firefox/1307615929.1307628304.14477.gz
WINNT 6.1 x86-64 mozilla-central build on 2011/06/09 03:38:49

s: mw64-ix-slave01
TEST-UNEXPECTED-FAIL | jit_test.py                | e:\builds\moz2_slave\cen-w64\build\js\src\jit-test\tests\jaeger\bug600139.js
make[1]: *** [check-jit-test] Error 2
make: *** [check] Error 2
Comment 3 Treeherder Robot 2011-06-12 22:42:17 PDT
philor
http://tinderbox.mozilla.org/showlog.cgi?log=Firefox/1307647771.1307661068.24789.gz
WINNT 6.1 x86-64 mozilla-central build on 2011/06/09 12:29:31

s: mw64-ix-slave01
TEST-UNEXPECTED-FAIL | jit_test.py -a -m -j       | e:\builds\moz2_slave\cen-w64\build\js\src\jit-test\tests\basic\bug602088.js
TEST-UNEXPECTED-FAIL | jit_test.py                | e:\builds\moz2_slave\cen-w64\build\js\src\jit-test\tests\closures\name-inactive-missing.js
make[1]: *** [check-jit-test] Error 2
make: *** [check] Error 2
Comment 4 Phil Ringnalda (:philor) 2011-06-12 22:44:01 PDT
http://tinderbox.mozilla.org/showlog.cgi?log=Firefox/1307692499.1307697196.3590.gz
TEST-UNEXPECTED-FAIL | jit_test.py -m -j -p | e:\builds\moz2_slave\cen-w64\build\js\src\jit-test\tests\basic\bug584499-1.js: 1
TEST-UNEXPECTED-FAIL | jit_test.py -m | e:\builds\moz2_slave\cen-w64\build\js\src\jit-test\tests\jaeger\bug577580.js
Comment 5 Phil Ringnalda (:philor) 2011-06-12 22:45:16 PDT
http://tinderbox.mozilla.org/showlog.cgi?log=Firefox/1307697303.1307709146.1544.gz
TEST-UNEXPECTED-FAIL | jit_test.py -j | e:\builds\moz2_slave\cen-w64\build\js\src\jit-test\tests\closures\bug540131-2.js
Comment 6 Phil Ringnalda (:philor) 2011-06-12 22:47:08 PDT
http://tinderbox.mozilla.org/showlog.cgi?log=Firefox/1307930414.1307942420.13482.gz
TEST-UNEXPECTED-FAIL | jit_test.py -m -j | e:\builds\moz2_slave\cen-w64\build\js\src\jit-test\tests\basic\bug605015.js: undefined
Comment 7 Phil Ringnalda (:philor) 2011-06-13 08:37:37 PDT
http://tinderbox.mozilla.org/showlog.cgi?log=Firefox/1307947790.1307952331.11589.gz
TEST-UNEXPECTED-FAIL | jit_test.py -a -m -j | e:\builds\moz2_slave\cen-w64\build\js\src\jit-test\tests\basic\bug601395.js
Comment 8 Phil Ringnalda (:philor) 2011-06-18 17:33:43 PDT
Still happening, like two of the last six, but I'm no longer forced to watch tbpl.m.o/?noignore=1, so I no longer see them or have to star them.
Comment 9 Ted Mielczarek [:ted.mielczarek] 2011-07-18 05:07:41 PDT
*** Bug 670697 has been marked as a duplicate of this bug. ***
Comment 10 Armen Zambrano [:armenzg] - Engineering productivity 2011-07-18 07:20:18 PDT
# Failures from June 27th to July 9th
FAILURES:
    e:\builds\moz2_slave\m-cen-w64\build\js\src\jit-test\tests\closures\bug540131-2.js
    e:\builds\moz2_slave\m-cen-w64\build\js\src\jit-test\tests\jaeger\bug554580-2.js
FAILURES:
    e:\builds\moz2_slave\m-cen-w64\build\js\src\jit-test\tests\jaeger\bug624100.js
FAILURES:
    -a -m -j -p e:\builds\moz2_slave\m-cen-w64\build\js\src\jit-test\tests\basic\bug601395.js
    -a -m -d e:\builds\moz2_slave\m-cen-w64\build\js\src\jit-test\tests\jaeger\bug577580.js
    -a -m -j e:\builds\moz2_slave\m-cen-w64\build\js\src\jit-test\tests\jaeger\bug583684.js
FAILURES:
    -m e:\builds\moz2_slave\m-cen-w64\build\js\src\jit-test\tests\basic\bug582161.js
    -a -m -j e:\builds\moz2_slave\m-cen-w64\build\js\src\jit-test\tests\jaeger\bug549393-1.js
    -a -m -j -p e:\builds\moz2_slave\m-cen-w64\build\js\src\jit-test\tests\jaeger\bug580883.js
    -m -j e:\builds\moz2_slave\m-cen-w64\build\js\src\jit-test\tests\jaeger\bug627486.js
FAILURES:
    e:\builds\moz2_slave\cen-w64\build\js\src\jit-test\tests\jaeger\bug583684.js
    -a -m -d e:\builds\moz2_slave\cen-w64\build\js\src\jit-test\tests\jaeger\bug600139.js
FAILURES:
    -a -m e:\builds\moz2_slave\cen-w64\build\js\src\jit-test\tests\closures\nameinc-loop-missing.js
FAILURES:
    -a -m e:\builds\moz2_slave\cen-w64\build\js\src\jit-test\tests\jaeger\bug582900.js
FAILURES:
    -m -j -p e:\builds\moz2_slave\cen-w64\build\js\src\jit-test\tests\basic\bug602088.js

TIMEOUTS:
make[1]: Leaving directory `/e/builds/moz2_slave/m-cen-w64/build/obj-firefox/js/src'
make[1]: *** [check-jit-test] Error 2
make[1]: Target `check' not remade because of errors.
make: *** [check] Error 2
Comment 11 Tim Taubert [:ttaubert] 2011-08-20 06:21:03 PDT
http://tinderbox.mozilla.org/showlog.cgi?log=Fx-Team/1313833169.1313845468.29475.gz

s: w64-ix-slave36
TEST-UNEXPECTED-FAIL | jit_test.py -j             | e:\builds\moz2_slave\fx-team-w64\build\js\src\jit-test\tests\jaeger\bug554580-3.js
make[1]: *** [check-jit-test] Error 2
make: *** [check] Error 2
Comment 12 Tim Taubert [:ttaubert] 2011-08-21 04:01:50 PDT
http://tinderbox.mozilla.org/showlog.cgi?log=Fx-Team/1313916320.1313920443.31597.gz

s: w64-ix-slave12
TEST-UNEXPECTED-FAIL | jit_test.py -a -m -j -p    | e:\builds\moz2_slave\fx-team-w64\build\js\src\jit-test\tests\jaeger\bug627486.js
make[1]: *** [check-jit-test] Error 2
make: *** [check] Error 2
Comment 13 Tim Taubert [:ttaubert] 2011-08-21 05:02:34 PDT
http://tinderbox.mozilla.org/showlog.cgi?log=Fx-Team/1313923340.1313927496.27629.gz

s: w64-ix-slave12
TEST-UNEXPECTED-FAIL | jit_test.py -a -m          | e:\builds\moz2_slave\fx-team-w64\build\js\src\jit-test\tests\jaeger\bug582882.js
TEST-UNEXPECTED-FAIL | jit_test.py -a -m -d       | e:\builds\moz2_slave\fx-team-w64\build\js\src\jit-test\tests\jaeger\instanceOfWithKnownTypes.js
make[1]: *** [check-jit-test] Error 2
make: *** [check] Error 2
Comment 14 Treeherder Robot 2011-08-21 23:10:39 PDT
ttaubert
http://tinderbox.mozilla.org/showlog.cgi?log=Fx-Team/1313980529.1313984812.20002.gz
WINNT 6.1 x86-64 fx-team build on 2011/08/21 19:35:29

s: w64-ix-slave36
TEST-UNEXPECTED-FAIL | jit_test.py -j             | e:\builds\moz2_slave\fx-team-w64\build\js\src\jit-test\tests\basic\testProxyConstructors.js
TEST-UNEXPECTED-FAIL | jit_test.py                | e:\builds\moz2_slave\fx-team-w64\build\js\src\jit-test\tests\jaeger\bug624100.js
TEST-UNEXPECTED-FAIL | jit_test.py                | e:\builds\moz2_slave\fx-team-w64\build\js\src\jit-test\tests\jaeger\instanceOfWithKnownTypes.js
TEST-UNEXPECTED-FAIL | jit_test.py -m -j          | e:\builds\moz2_slave\fx-team-w64\build\js\src\jit-test\tests\jaeger\instanceOfWithKnownTypes.js
make[1]: *** [check-jit-test] Error 2
make: *** [check] Error 2
Comment 15 Tim Taubert [:ttaubert] 2011-08-22 02:15:22 PDT
tinderbox.mozilla.org/showlog.cgi?log=Fx-Team/1313999609.1314003904.707.gz

s: w64-ix-slave36
TEST-UNEXPECTED-FAIL | jit_test.py -m             | e:\builds\moz2_slave\fx-team-w64\build\js\src\jit-test\tests\jaeger\bug624100.js
make[1]: *** [check-jit-test] Error 2
make: *** [check] Error 2
Comment 16 Treeherder Robot 2011-08-23 02:44:58 PDT
jfkthame%gmail.com
http://tinderbox.mozilla.org/showlog.cgi?log=Mozilla-Beta/1314050969.1314062162.14021.gz
WINNT 6.1 x86-64 mozilla-beta build on 2011/08/22 15:09:29

s: w64-ix-slave19
TEST-UNEXPECTED-FAIL | jit_test.py -a -m -d       | e:\builds\moz2_slave\m-beta-w64\build\js\src\jit-test\tests\basic\bug601395.js
TEST-UNEXPECTED-FAIL | jit_test.py                | e:\builds\moz2_slave\m-beta-w64\build\js\src\jit-test\tests\jaeger\bug583684.js
make[1]: *** [check-jit-test] Error 2
make: *** [check] Error 2
Comment 17 Armen Zambrano [:armenzg] - Engineering productivity 2011-08-23 06:46:40 PDT
(In reply to TinderboxPushlog Robot from comment #16)
> jfkthame%gmail.com
> http://tinderbox.mozilla.org/showlog.cgi?log=Mozilla-Beta/1314050969.
> 1314062162.14021.gz
> WINNT 6.1 x86-64 mozilla-beta build on 2011/08/22 15:09:29
> 
I enabled win64 on mozilla-beta by mistake. I will be fixing it.
Comment 18 Tim Taubert [:ttaubert] 2011-08-24 02:31:03 PDT
http://tinderbox.mozilla.org/showlog.cgi?log=Fx-Team/1314104742.1314116902.9282.gz

s: w64-ix-slave10
TEST-UNEXPECTED-FAIL | jit_test.py -a -m -j       | e:\builds\moz2_slave\fx-team-w64\build\js\src\jit-test\tests\jaeger\bug549393-1.js
TEST-UNEXPECTED-FAIL | jit_test.py -a -m -d       | e:\builds\moz2_slave\fx-team-w64\build\js\src\jit-test\tests\jaeger\strictModeSetUndefinedVar.js
make[1]: *** [check-jit-test] Error 2
make: *** [check] Error 2
Comment 19 Armen Zambrano [:armenzg] - Engineering productivity 2011-08-24 06:46:33 PDT
See also a similar bug 658920.
Comment 20 Tim Taubert [:ttaubert] 2011-08-24 10:46:04 PDT
http://tinderbox.mozilla.org/showlog.cgi?log=Fx-Team/1314186149.1314198661.11900.gz

s: w64-ix-slave36
TEST-UNEXPECTED-FAIL | jit_test.py -m -j          | e:\builds\moz2_slave\fx-team-w64\build\js\src\jit-test\tests\jaeger\strictModeSetUndefinedVar.js
make[1]: *** [check-jit-test] Error 2
make: *** [check] Error 2
Comment 21 Treeherder Robot 2011-08-25 02:28:47 PDT
ttaubert
http://tinderbox.mozilla.org/showlog.cgi?log=Fx-Team/1314251682.1314263697.10952.gz
WINNT 6.1 x86-64 fx-team build on 2011/08/24 22:54:42

s: w64-ix-slave10
TEST-UNEXPECTED-FAIL | jit_test.py                | e:\builds\moz2_slave\fx-team-w64\build\js\src\jit-test\tests\basic\bug629858.js
TEST-UNEXPECTED-FAIL | jit_test.py -j             | e:\builds\moz2_slave\fx-team-w64\build\js\src\jit-test\tests\basic\testBug653396.js
make[1]: *** [check-jit-test] Error 2
make: *** [check] Error 2
Comment 22 Armen Zambrano [:armenzg] - Engineering productivity 2011-08-26 14:37:43 PDT
dmandelin do you know who could help us fix this bug?
Comment 23 Makoto Kato [:m_kato] 2011-08-30 22:08:45 PDT
All failured tests have "|jit-test|" entry to compare the exception.  When this occurs, python (jit-tests.py) doesn't get the any output by pipe() and communicate().

Armen, what python version do we use on builder?
Comment 24 Makoto Kato [:m_kato] 2011-08-31 05:22:16 PDT
Created attachment 557124 [details] [diff] [review]
potential fix
Comment 25 Armen Zambrano [:armenzg] - Engineering productivity 2011-08-31 06:57:33 PDT
(In reply to Makoto Kato from comment #23)
> Armen, what python version do we use on builder?

Python 2.6.5
Comment 26 Makoto Kato [:m_kato] 2011-08-31 20:23:08 PDT
Without python, I could reproduce this rarely using js.exe + cmd.exe only.  This seems to be output issue...  After fixing potential fix, there is no failure on my environment.
Comment 28 Kyle Huey [:khuey] (khuey@mozilla.com) (Away until 6/13) 2011-09-05 05:07:20 PDT
http://hg.mozilla.org/mozilla-central/rev/6d0812c1f610

Note You need to log in before you can comment on or make changes to this bug.